{"text_format":"1","workbook":"xlsx","n_sheets":3,"sheets":["抽選会","出場校","印刷"],"not_rendered":{"charts":0,"images":0,"macros":1,"external_links":0,"defined_names":2,"comments":0,"pivot_tables":0},"unopened":[],"bounds":{"document_bytes":16777216,"sheet_cells":100000,"rows_first":2000,"rows_last":500,"rows_between":2000,"halvings":0,"cell_chars":16384,"cell_head_chars":4096},"cells_cut":0,"cells_raw":0,"read":"whole","date_system":"1900"}

{"sheet":"抽選会","index":0,"n_rows":20,"n_cols":34,"rows_kept":20,"cut":false,"hidden":false,"merged":[[19,7,19,8],[19,9,19,10],[10,1,11,4],[8,1,9,4],[8,7,8,14],[9,7,9,14],[18,3,18,4],[18,5,18,6],[10,7,10,14],[11,5,11,8],[17,3,17,4],[17,5,17,6],[19,11,19,12],[19,13,19,14],[12,5,12,8],[13,5,13,8],[19,31,19,32],[19,33,19,34],[19,19,19,20],[19,21,19,22],[19,23,19,24],[19,25,19,26],[19,27,19,28],[19,29,19,30],[19,15,19,16],[19,17,19,18],[19,3,19,4],[19,5,19,6],[0,1,0,35],[14,4,14,5],[15,4,15,5],[16,4,16,5],[5,11,5,26],[6,11,6,26],[15,28,15,29],[15,20,15,21],[2,29,2,35],[3,29,3,35],[1,29,1,35],[9,23,9,30],[10,23,10,30],[4,29,4,35],[8,23,8,30],[11,29,11,32],[7,11,7,26],[11,13,11,16],[12,13,12,16],[13,13,13,16],[12,29,12,32],[13,29,13,32],[11,21,11,24],[12,21,12,24],[13,21,13,24],[14,32,14,33],[15,32,15,33],[16,32,16,33],[16,20,16,21],[14,24,14,25],[15,24,15,25],[16,24,16,25],[14,20,14,21],[16,28,16,29],[14,28,14,29],[14,16,14,17],[14,12,14,13],[17,15,17,16],[18,11,18,12],[18,13,18,14],[18,15,18,16],[18,17,18,18],[17,13,17,14],[14,8,14,9],[15,8,15,9],[16,8,16,9],[17,7,17,8],[17,9,17,10],[18,7,18,8],[18,9,18,10],[15,16,15,17],[15,12,15,13],[17,11,17,12],[16,12,16,13],[17,17,17,18],[16,16,16,17],[18,33,18,34],[17,19,17,20],[17,21,17,22],[17,31,17,32],[17,33,17,34],[17,23,17,24],[17,25,17,26],[17,27,17,28],[18,31,18,32],[17,29,17,30],[18,21,18,22],[18,19,18,20],[18,23,18,24],[18,25,18,26],[18,27,18,28],[18,29,18,30]]}
[null,"第５２回九州高校女子ソフトボール選手権大会"]
[null,null,null,null,null,null,null,null,null,null,null,null,null,null,null,null,null,null,null,null,null,null,null,null,null,null,null,null,null,"　ａ球場：竹田市民球場"]
[null,null,null,null,null,null,null,null,null,null,null,null,null,null,null,null,null,null,null,null,null,null,null,null,null,null,null,null,null,"　ｂ球場：多目的広場Ａｺｰﾄ（手前）"]
[null,null,null,null,null,null,null,null,null,null,null,null,null,null,null,null,null,null,null,null,null,null,null,null,null,null,null,null,null,"　ｃ球場：多目的広場Ｂｺｰﾄ（奥）"]
[null,null,null,null,null,null,null,null,null,null,null,null,null,null,null,null,null,null,null,null,null,null,null,null,null,null,null,null,null,"　ｄ球場：飛田川野球場"]
[null,null,null,null,null,null,null,null,null,null,null,"決勝戦"]
[null,null,null,null,null,null,null,null,null,null,null,"a-4"]
[null,null,null,null,null,null,null,null,null,null,null,"14:00:00"]
[null,"１３日（日）",null,null,null,null,null,"M",null,null,null,null,null,null,null,null,null,null,null,null,null,null,null,"N"]
[null,null,null,null,null,null,null,"a-2",null,null,null,null,null,null,null,null,null,null,null,null,null,null,null,"b-2"]
[null,"１２日（土）",null,null,null,null,null,"10:00:00",null,null,null,null,null,null,null,null,null,null,null,null,null,null,null,"10:00:00"]
[null,null,null,null,null,"I",null,null,null,null,null,null,null,"J",null,null,null,null,null,null,null,"K",null,null,null,null,null,null,null,"L"]
[null,null,null,null,null,"a-3",null,null,null,null,null,null,null,"a-4",null,null,null,null,null,null,null,"c-3",null,null,null,null,null,null,null,"c-4"]
[null,null,null,null,null,"11:30:00",null,null,null,null,null,null,null,"13:00:00",null,null,null,null,null,null,null,"11:30:00",null,null,null,null,null,null,null,"13:00:00"]
[null,null,null,null,"A",null,null,null,"B",null,null,null,"C",null,null,null,"D",null,null,null,"E",null,null,null,"F",null,null,null,"G",null,null,null,"H"]
[null,null,null,null,"a-1",null,null,null,"b-1",null,null,null,"a-2",null,null,null,"b-2",null,null,null,"c-1",null,null,null,"d-1",null,null,null,"c-2",null,null,null,"d-2"]
[null,null,null,null,"08:30:00",null,null,null,"08:30:00",null,null,null,"10:00:00",null,null,null,"10:00:00",null,null,null,"08:30:00",null,null,null,"08:30:00",null,null,null,"10:00:00",null,null,null,"10:00:00"]
[null,null,null,{"$f":"LOOKUP(D20,出場校!$A$1:$P$1,出場校!$A$2:$P$2)","v":"佐賀女子高校（佐賀県）"},null,{"$f":"LOOKUP(F20,出場校!$A$1:$P$1,出場校!$A$2:$P$2)","v":"昭和学園高校（大分県）"},null,{"$f":"LOOKUP(H20,出場校!$A$1:$P$1,出場校!$A$2:$P$2)","v":"北九州市立高校（福岡県）"},null,{"$f":"LOOKUP(J20,出場校!$A$1:$P$1,出場校!$A$2:$P$2)","v":"長崎商業高校（長崎県）"},null,{"$f":"LOOKUP(L20,出場校!$A$1:$P$1,出場校!$A$2:$P$2)","v":"文徳高校（熊本県）"},null,{"$f":"LOOKUP(N20,出場校!$A$1:$P$1,出場校!$A$2:$P$2)","v":"都城東高校（宮崎県）"},null,{"$f":"LOOKUP(P20,出場校!$A$1:$P$1,出場校!$A$2:$P$2)","v":"神村学園高等部（鹿児島県）"},null,{"$f":"LOOKUP(R20,出場校!$A$1:$P$1,出場校!$A$2:$P$2)","v":"コザ高校（沖縄県）"},null,{"$f":"LOOKUP(T20,出場校!$A$1:$P$1,出場校!$A$2:$P$2)","v":"読谷高校（沖縄県）"},null,{"$f":"LOOKUP(V20,出場校!$A$1:$P$1,出場校!$A$2:$P$2)","v":"三潴高校（福岡県）"},null,{"$f":"LOOKUP(X20,出場校!$A$1:$P$1,出場校!$A$2:$P$2)","v":"宮崎日本大学高校（宮崎県）"},null,{"$f":"LOOKUP(Z20,出場校!$A$1:$P$1,出場校!$A$2:$P$2)","v":"熊本商業高校（熊本県）"},null,{"$f":"LOOKUP(AB20,出場校!$A$1:$P$1,出場校!$A$2:$P$2)","v":"大分南高校（大分県）"},null,{"$f":"LOOKUP(AD20,出場校!$A$1:$P$1,出場校!$A$2:$P$2)","v":"鹿児島女子高校（鹿児島県）"},null,{"$f":"LOOKUP(AF20,出場校!$A$1:$P$1,出場校!$A$2:$P$2)","v":"九州文化学園高校（長崎県）"},null,{"$f":"LOOKUP(AH20,出場校!$A$1:$P$1,出場校!$A$2:$P$2)","v":"鹿島・鹿島実・鹿島新高校（佐賀県）"}]
[null,null,null,1,null,2,null,3,null,4,null,5,null,6,null,7,null,8,null,9,null,10,null,11,null,12,null,13,null,14,null,15,null,16]
[null,null,null,3,null,16,null,1,null,6,null,7,null,10,null,11,null,14,null,13,null,2,null,9,null,8,null,15,null,12,null,5,null,4]

{"sheet":"出場校","index":1,"n_rows":2,"n_cols":16,"rows_kept":2,"cut":false,"hidden":false,"merged":[]}
[1,2,3,4,5,6,7,8,9,10,11,12,13,14,15,16]
["北九州市立高校（福岡県）","三潴高校（福岡県）","佐賀女子高校（佐賀県）","鹿島・鹿島実・鹿島新高校（佐賀県）","九州文化学園高校（長崎県）","長崎商業高校（長崎県）","文徳高校（熊本県）","熊本商業高校（熊本県）","宮崎日本大学高校（宮崎県）","都城東高校（宮崎県）","神村学園高等部（鹿児島県）","鹿児島女子高校（鹿児島県）","読谷高校（沖縄県）","コザ高校（沖縄県）","大分南高校（大分県）","昭和学園高校（大分県）"]

{"sheet":"印刷","index":2,"n_rows":52,"n_cols":33,"rows_kept":52,"cut":false,"hidden":false,"merged":[[2,14,2,21],[24,24,24,25],[24,26,24,30],[3,14,3,15],[3,16,3,21],[18,18,18,19],[11,20,11,21],[19,20,19,21],[19,18,19,19],[18,14,18,15],[18,16,18,17],[19,10,19,11],[19,12,19,13],[19,14,19,15],[18,12,18,13],[18,10,18,11],[19,16,19,17],[29,0,30,3],[31,0,32,3],[19,6,19,7],[19,2,19,3],[19,4,19,5],[21,0,22,4],[10,0,12,2],[18,6,18,7],[18,8,18,9],[24,5,24,6],[24,7,24,11],[19,8,19,9],[18,2,18,3],[18,4,18,5],[0,0,0,34],[3,2,3,8],[2,2,2,8],[19,32,19,33],[19,22,19,23],[19,28,19,29],[19,30,19,31],[18,20,18,21],[18,24,18,25],[18,26,18,27],[18,32,18,33],[18,22,18,23],[18,28,18,29],[18,30,18,31],[19,24,19,25],[19,26,19,27],[7,0,9,3],[51,30,51,31],[51,22,51,23],[51,24,51,25],[51,26,51,27],[51,28,51,29],[38,4,38,5],[41,25,41,27],[44,30,45,34],[38,30,38,31],[51,2,51,3],[51,4,51,5],[51,6,51,7],[51,8,51,9],[51,10,51,11],[51,12,51,13],[51,14,51,15],[51,16,51,17],[39,0,40,6],[44,0,45,4],[44,12,45,16],[41,0,42,4],[41,7,41,9],[41,12,42,16],[51,32,51,33],[38,16,38,17],[38,18,38,19],[44,7,44,9],[51,18,51,19],[51,20,51,21],[41,30,42,34],[44,18,45,22],[38,14,38,15],[44,25,44,27],[38,6,38,7],[41,18,42,22],[38,28,38,29],[40,7,40,10],[38,20,38,21],[38,22,38,23],[38,12,38,13],[38,24,38,25],[38,26,38,27],[38,8,38,9],[38,10,38,11]]}
["第５２回九州高校女子ソフトボール選手権大会"]
[]
[null,null,"平成30年5月12日・13日",null,null,null,null,null,null,null,null,null,null,null,"2年連続3度目の優勝",null,null,null,null,null,null,null,null,null,null,null,null,null," "]
[null," ","大分県竹田市総合運動公園",null,null,null,null,null,null,null,null,null,null,null,"優勝",null,"九州文化学園高校",null,null,null,null,null,null,null,null,null,null,null," "]
[null,null,null,null,null,null,null,null,null,null,0,null,null,null,null,null,null,null,null,null,null,null,null,null,null,1,null,null," "]
[null,null,null,null,null,null,null,null,null,null," ",null,null,null,null,null,null,null,null,null,null,null,null,null,null,null,null,null," "]
[null,null,null,null,null,null,null,null,null,null," "]
["１３日(日)",null,null,null,null,null,1,null,null,null," ",null,null,4,null,null,null,null,null,null,null,null,0,null,null,null,null,null,null,7]
[null,null,null,null,null,null," ",null,null,null,null,null,null,null,null,null,null,null," ",null,null,null," "]
[null,null,null,null,null,null," ",null,null,null,null,null,null,null,null,null,null,null,null,null,null,null," "]
["１２日(土)",null,null,null,2,null," ",0,null," ",null,null,0,null,null,3,null,null,null,null,3,null," ",0,null," ",null,null,0,null,null,3]
[null,null,null,null,"　",null,null,null,null,null,null,null,"　",null,null,null,null,null,null,null," ",null,null,null,null,null,null,null," "]
[null,null,null,null,"　",null,null,null,null,null,null,null,"　",null,null,null,null,null,null,null,"　",null,null,null,null,null,null,null,"　"]
[null,null,null,7,0,"　",null,4,3,null,null,5,3,"　",null,7,0,null,null,0,"7","　",null,1,5,null,null,5,7,"　",null,6,"0"]
[null,null,null," ",null,null,null," ",null,null,null," ",null,null,null," ",null,null,null," ",null,null,null," ",null,null,null," ",null,null,null," "]
[null,null,null," ",null,null,null," ",null,null,null," ",null,null,null," ",null,null,null," ",null,null,null," ",null,null,null," ",null,null,null," "]
[null,null,null," ",null,null,null," ",null,null,null," ",null,null,null," ",null,null,null," ",null,null,null," ",null,null,null," ",null,null,null," "]
[]
[null,null,{"$f":"LOOKUP(C52,出場校!$A$1:$P$1,出場校!$A$2:$P$2)","v":"佐賀女子高校（佐賀県）"},null,{"$f":"LOOKUP(E52,出場校!$A$1:$P$1,出場校!$A$2:$P$2)","v":"昭和学園高校（大分県）"},null,{"$f":"LOOKUP(G52,出場校!$A$1:$P$1,出場校!$A$2:$P$2)","v":"北九州市立高校（福岡県）"},null,{"$f":"LOOKUP(I52,出場校!$A$1:$P$1,出場校!$A$2:$P$2)","v":"長崎商業高校（長崎県）"},null,{"$f":"LOOKUP(K52,出場校!$A$1:$P$1,出場校!$A$2:$P$2)","v":"文徳高校（熊本県）"},null,{"$f":"LOOKUP(M52,出場校!$A$1:$P$1,出場校!$A$2:$P$2)","v":"都城東高校（宮崎県）"},null,{"$f":"LOOKUP(O52,出場校!$A$1:$P$1,出場校!$A$2:$P$2)","v":"神村学園高等部（鹿児島県）"},null,{"$f":"LOOKUP(Q52,出場校!$A$1:$P$1,出場校!$A$2:$P$2)","v":"コザ高校（沖縄県）"},null,{"$f":"LOOKUP(S52,出場校!$A$1:$P$1,出場校!$A$2:$P$2)","v":"読谷高校（沖縄県）"},null,{"$f":"LOOKUP(U52,出場校!$A$1:$P$1,出場校!$A$2:$P$2)","v":"三潴高校（福岡県）"},null,{"$f":"LOOKUP(W52,出場校!$A$1:$P$1,出場校!$A$2:$P$2)","v":"宮崎日本大学高校（宮崎県）"},null,{"$f":"LOOKUP(Y52,出場校!$A$1:$P$1,出場校!$A$2:$P$2)","v":"熊本商業高校（熊本県）"},null,{"$f":"LOOKUP(AA52,出場校!$A$1:$P$1,出場校!$A$2:$P$2)","v":"大分南高校（大分県）"},null,{"$f":"LOOKUP(AC52,出場校!$A$1:$P$1,出場校!$A$2:$P$2)","v":"鹿児島女子高校（鹿児島県）"},null,{"$f":"LOOKUP(AE52,出場校!$A$1:$P$1,出場校!$A$2:$P$2)","v":"九州文化学園高校（長崎県）"},null,{"$f":"LOOKUP(AG52,出場校!$A$1:$P$1,出場校!$A$2:$P$2)","v":"鹿島・鹿島実・鹿島新高校（佐賀県）"}]
[null,null,1,null,2,null,3,null,4,null,5,null,6,null,7,null,8,null,9,null,10,null,11,null,12,null,13,null,14,null,15,null,16]
[]
["敗者復活戦"]
[]
[]
[null,null,null,null,null,"3位",null,"文徳高校",null,null,null,null,null,null,null,null,null,null,null,null,null,null,null,null,"3位",null,"佐賀女子高校"]
[null,null,null,null,null,0,null,null,null,null,null,1,null,null,null,null,null,null,null,null,null,null,null,null,0,null,null,null,null,null,7]
[null,null,null,null,null," ",null,null,null,null,null,null,null,null,null,null,null,null,null,null,null,null,null,null," "]
[null,null,null,null,null," ",null,null,null,null,null,null,null,null,null,null,null,null,null,null,null,null,null,null," "]
[null,null,null,null,null," ",null,null,null,null,1,null,null,0,null,null,null,null,null,null,null,null,1,null," ",2]
["１３日(日)",null,null,null,null,null,null,null,null,null," ",null,null,null,null,null,null,null,null,null,null,null," "]
[null,null,null,null,null,null,null,null,null,null," ",null,null,null,null,null,null,null,null,null,null,null," "]
["１２日(土)",null,null,null,null,null,null,null,0,null,1," ",null,2,null,0,null,null,null,null,0,null,1," ",null,4,null,1]
[null,null,null,null,null,null,null,null,"　",null,null,null,null,"　",null,null,null,null,null,null,"　",null,null,null,null,"　"]
[null,null,null,null,null,null,null,null,"　",null,null,null,null,"　",null,null,null,null,null,null,"　",null,null,null,null,"　"]
[null,null,null,null,null,null,null,2,"0",null,null,null,null,"　",null,5,0,null,null,4,"2",null,null,null,null,"　",null,0,2]
[null,null,null,null,null,null,null,"　",null,null,null,null,null,null,null,"　",null,null,null," ",null,null,null,null,null,null,null,"　"]
[null,null,null,null,null,null,null,"　",null,null,null,null,null,null,null,"　",null,null,null," ",null,null,null,null,null,null,null,"　"]
[null,null,null,null,null,null,null,"　",null,null,null,null,null,null,null,"　",null,null,null," ",null,null,null,null,null,null,null,"　"]
[null,null,null,null,"三潴高校",null,"昭和学園高校",null,"長崎商業高校",null,"文徳高校",null,"北九州市立高校",null,"都城東高校",null,"コザ高校",null,"読谷高校",null,"宮崎日本大学高校",null,"鹿児島女子高校",null,"熊本商業高校",null,"大分南高校",null,"鹿島・鹿島実・鹿島新高校",null,"佐賀女子高校"]
["交流戦（１３日）"]
[]
["読谷高校",null,null,null,null,"　",null,"c-1(8:30)",null,null,null,null,"宮崎日本大学高校",null,null,null,null,null,"昭和学園高校",null,null,null,null," ",null,"c-2(10:00)",null,null,null,null,"読谷高校"]
[]
[]
["コザ高校",null,null,null,null," ",null,"d-1(8:30)",null,null,null,null,"大分南高校",null,null,null,null,null,"都城東高校",null,null,null,null," ",null,"d-2(10:00)",null,null,null,null,"鹿島・鹿島実・鹿島新"]
[]
[]
[]
[]
[]
[]
[null,null,{"$f":"抽選会!D20","v":3},null,{"$f":"抽選会!F20","v":16},null,{"$f":"抽選会!H20","v":1},null,{"$f":"抽選会!J20","v":6},null,{"$f":"抽選会!L20","v":7},null,{"$f":"抽選会!N20","v":10},null,{"$f":"抽選会!P20","v":11},null,{"$f":"抽選会!R20","v":14},null,{"$f":"抽選会!T20","v":13},null,{"$f":"抽選会!V20","v":2},null,{"$f":"抽選会!X20","v":9},null,{"$f":"抽選会!Z20","v":8},null,{"$f":"抽選会!AB20","v":15},null,{"$f":"抽選会!AD20","v":12},null,{"$f":"抽選会!AF20","v":5},null,{"$f":"抽選会!AH20","v":4}]